{"text_format":"1","workbook":"xlsx","n_sheets":3,"sheets":["Paired Plot Comparison","Unpaired Plot Comparison","Dropdown Selections"],"not_rendered":{"charts":2,"images":0,"macros":1,"external_links":0,"defined_names":0,"comments":0,"pivot_tables":0},"unopened":[],"bounds":{"document_bytes":16777216,"sheet_cells":100000,"rows_first":2000,"rows_last":500,"rows_between":2000,"halvings":0,"cell_chars":16384,"cell_head_chars":4096},"cells_cut":0,"cells_raw":0,"read":"whole","date_system":"1900"}

{"sheet":"Paired Plot Comparison","index":0,"n_rows":112,"n_cols":16,"rows_kept":112,"cut":false,"hidden":false,"merged":[[0,0,0,7],[111,0,111,7],[1,0,1,7]]}
["Sequential Sampling Worksheet for Verification Inventory where Project Plots are Monumented ",null,null,null,null,null,null,null,"D0:",{"$f":"'Paired Plot Comparison'!B3","v":0},"Allowance:",0.1,"Zalpha:",1.645]
["(Paired Plot Comparison)"]
["Project/Stratum Mean (metric tons CO2e/acre):",0,null,null,null,null,null,null,"D1:",{"$f":"L1*'Paired Plot Comparison'!B3+J1","v":0},"Alpha:",0.05,"Zbeta:",0.84160000000000001]
["Number of Strata Verified:",1,null,null,null,null,null,null,null,null,"Beta:",0.2,"K:",{"$f":"ABS(($N$1*$J$6+$N$3*$J$5)/($N$1+$N$3))","v":0}]
["Project Acreage:","<100",null,null,null,null,null,null,"Mean_Diff0:",{"$f":"J1-'Paired Plot Comparison'!B3","v":0}]
["Minimum Number of Passing Plots Needed in Sequence:",{"$f":"plotnumber(B4, B5)","v":8},null,null,null,null,null,null,"Mean_Diff1:",{"$f":"J3-J1","v":0}]
[]
[]
[]
["Plot Pair (n)","Project Plot Number","Project CO2e estimate\n(metric tons/acre)","Verification CO2e estimate\n(metric tons/acre)","Running Mean","Running Examination/Plot Success","Number of Passing Plots in Sequence","Status of Verification","Y(n)","-K","K","Running SD","n_ Threshold"]
[1,null,null,null,{"$f":"'Paired Plot Comparison'!N14","v":0},{"$f":"IF('Paired Plot Comparison'!I11<>\"\",IF(ABS((C11-D11))<('Paired Plot Comparison'!L1*D11),\"Pass(H0)\",\"Inconclusive(H1)\"),\"\")","v":""},{"$f":"IF('Paired Plot Comparison'!I11<>\"\",IF(F11=\"Pass(H0)\",1,0),\"\")","v":""},{"$f":"IF('Paired Plot Comparison'!I11<>\"\",IF(G11>=$B$6,\"Verification Successful\", \"Verification not Satisfied\"),\"\")","v":""},{"$f":"IF('Paired Plot Comparison'!C11<>\"\",IF('Paired Plot Comparison'!D11<>\"\",'Paired Plot Comparison'!C11-'Paired Plot Comparison'!D11,\"\"),\"\")","v":""},{"$f":"-$N$4","v":0},{"$f":"$N$4","v":0},null,null,"Max",250,210]
[2,null,null,null,{"$f":"IF('Paired Plot Comparison'!I12<>\"\",AVERAGE('Paired Plot Comparison'!$I$11:I12),\"\")","v":""},{"$f":"IF('Paired Plot Comparison'!I12<>\"\",IF(A12>'Paired Plot Comparison'!M12,IF('Paired Plot Comparison'!E12>'Paired Plot Comparison'!$N$4,\"Inconclusive(H1)\",IF('Paired Plot Comparison'!E12<-'Paired Plot Comparison'!$N$4,\"Inconclusive(H1)\", \"Pass(H0)\")),\"Inconclusive\"),\"\")","v":""},{"$f":"IF('Paired Plot Comparison'!I12<>\"\",IF(F12=\"Pass(H0)\",1+G11,0),\"\")","v":""},{"$f":"IF('Paired Plot Comparison'!I12<>\"\",IF(G12>=$B$6,\"Verification Successful\", \"Verification not Satisfied\"),\"\")","v":""},{"$f":"IF('Paired Plot Comparison'!C12<>\"\",IF('Paired Plot Comparison'!D12<>\"\",'Paired Plot Comparison'!C12-'Paired Plot Comparison'!D12,\"\"),\"\")","v":""},0,0,{"$f":"IF(I12<>\"\",STDEV($I$11:I12),\"\")","v":""},{"$f":"IF(I12<>\"\",(($N$1+$N$3)^2*L12^2)/($L$1*'Paired Plot Comparison'!$B$3)^2,\"\")","v":""},"Min",150,190]
[3,null,null,null,{"$f":"IF('Paired Plot Comparison'!I13<>\"\",AVERAGE('Paired Plot Comparison'!$I$11:I13),\"\")","v":""},{"$f":"IF('Paired Plot Comparison'!I13<>\"\",IF(A13>'Paired Plot Comparison'!M13,IF('Paired Plot Comparison'!E13>'Paired Plot Comparison'!$N$4,\"Inconclusive(H1)\",IF('Paired Plot Comparison'!E13<-'Paired Plot Comparison'!$N$4,\"Inconclusive(H1)\", \"Pass(H0)\")),\"Inconclusive\"),\"\")","v":""},{"$f":"IF('Paired Plot Comparison'!I13<>\"\",IF(F13=\"Pass(H0)\",1+G12,0),\"\")","v":""},{"$f":"IF('Paired Plot Comparison'!I13<>\"\",IF(G13>=$B$6,\"Verification Successful\", \"Verification not Satisfied\"),\"\")","v":""},{"$f":"IF('Paired Plot Comparison'!C13<>\"\",IF('Paired Plot Comparison'!D13<>\"\",'Paired Plot Comparison'!C13-'Paired Plot Comparison'!D13,\"\"),\"\")","v":""},0,0,{"$f":"IF(I13<>\"\",STDEV($I$11:I13),\"\")","v":""},{"$f":"IF(I13<>\"\",(($N$1+$N$3)^2*L13^2)/($L$1*'Paired Plot Comparison'!$B$3)^2,\"\")","v":""}]
[4,null,null,null,{"$f":"IF('Paired Plot Comparison'!I14<>\"\",AVERAGE('Paired Plot Comparison'!$I$11:I14),\"\")","v":""},{"$f":"IF('Paired Plot Comparison'!I14<>\"\",IF(A14>'Paired Plot Comparison'!M14,IF('Paired Plot Comparison'!E14>'Paired Plot Comparison'!$N$4,\"Inconclusive(H1)\",IF('Paired Plot Comparison'!E14<-'Paired Plot Comparison'!$N$4,\"Inconclusive(H1)\", \"Pass(H0)\")),\"Inconclusive\"),\"\")","v":""},{"$f":"IF('Paired Plot Comparison'!I14<>\"\",IF(F14=\"Pass(H0)\",1+G13,0),\"\")","v":""},{"$f":"IF('Paired Plot Comparison'!I14<>\"\",IF(G14>=$B$6,\"Verification Successful\", \"Verification not Satisfied\"),\"\")","v":""},{"$f":"IF('Paired Plot Comparison'!C14<>\"\",IF('Paired Plot Comparison'!D14<>\"\",'Paired Plot Comparison'!C14-'Paired Plot Comparison'!D14,\"\"),\"\")","v":""},0,0,{"$f":"IF(I14<>\"\",STDEV($I$11:I14),\"\")","v":""},{"$f":"IF(I14<>\"\",(($N$1+$N$3)^2*L14^2)/($L$1*'Paired Plot Comparison'!$B$3)^2,\"\")","v":""}]
[5,null,null,null,{"$f":"IF('Paired Plot Comparison'!I15<>\"\",AVERAGE('Paired Plot Comparison'!$I$11:I15),\"\")","v":""},{"$f":"IF('Paired Plot Comparison'!I15<>\"\",IF(A15>'Paired Plot Comparison'!M15,IF('Paired Plot Comparison'!E15>'Paired Plot Comparison'!$N$4,\"Inconclusive(H1)\",IF('Paired Plot Comparison'!E15<-'Paired Plot Comparison'!$N$4,\"Inconclusive(H1)\", \"Pass(H0)\")),\"Inconclusive\"),\"\")","v":""},{"$f":"IF('Paired Plot Comparison'!I15<>\"\",IF(F15=\"Pass(H0)\",1+G14,0),\"\")","v":""},{"$f":"IF('Paired Plot Comparison'!I15<>\"\",IF(G15>=$B$6,\"Verification Successful\", \"Verification not Satisfied\"),\"\")","v":""},{"$f":"IF('Paired Plot Comparison'!C15<>\"\",IF('Paired Plot Comparison'!D15<>\"\",'Paired Plot Comparison'!C15-'Paired Plot Comparison'!D15,\"\"),\"\")","v":""},0,0,{"$f":"IF(I15<>\"\",STDEV($I$11:I15),\"\")","v":""},{"$f":"IF(I15<>\"\",(($N$1+$N$3)^2*L15^2)/($L$1*'Paired Plot Comparison'!$B$3)^2,\"\")","v":""}]
[6,null,null,null,{"$f":"IF('Paired Plot Comparison'!I16<>\"\",AVERAGE('Paired Plot Comparison'!$I$11:I16),\"\")","v":""},{"$f":"IF('Paired Plot Comparison'!I16<>\"\",IF(A16>'Paired Plot Comparison'!M16,IF('Paired Plot Comparison'!E16>'Paired Plot Comparison'!$N$4,\"Inconclusive(H1)\",IF('Paired Plot Comparison'!E16<-'Paired Plot Comparison'!$N$4,\"Inconclusive(H1)\", \"Pass(H0)\")),\"Inconclusive\"),\"\")","v":""},{"$f":"IF('Paired Plot Comparison'!I16<>\"\",IF(F16=\"Pass(H0)\",1+G15,0),\"\")","v":""},{"$f":"IF('Paired Plot Comparison'!I16<>\"\",IF(G16>=$B$6,\"Verification Successful\", \"Verification not Satisfied\"),\"\")","v":""},{"$f":"IF('Paired Plot Comparison'!C16<>\"\",IF('Paired Plot Comparison'!D16<>\"\",'Paired Plot Comparison'!C16-'Paired Plot Comparison'!D16,\"\"),\"\")","v":""},0,0,{"$f":"IF(I16<>\"\",STDEV($I$11:I16),\"\")","v":""},{"$f":"IF(I16<>\"\",(($N$1+$N$3)^2*L16^2)/($L$1*'Paired Plot Comparison'!$B$3)^2,\"\")","v":""}]
[7,null,null,null,{"$f":"IF('Paired Plot Comparison'!I17<>\"\",AVERAGE('Paired Plot Comparison'!$I$11:I17),\"\")","v":""},{"$f":"IF('Paired Plot Comparison'!I17<>\"\",IF(A17>'Paired Plot Comparison'!M17,IF('Paired Plot Comparison'!E17>'Paired Plot Comparison'!$N$4,\"Inconclusive(H1)\",IF('Paired Plot Comparison'!E17<-'Paired Plot Comparison'!$N$4,\"Inconclusive(H1)\", \"Pass(H0)\")),\"Inconclusive\"),\"\")","v":""},{"$f":"IF('Paired Plot Comparison'!I17<>\"\",IF(F17=\"Pass(H0)\",1+G16,0),\"\")","v":""},{"$f":"IF('Paired Plot Comparison'!I17<>\"\",IF(G17>=$B$6,\"Verification Successful\", \"Verification not Satisfied\"),\"\")","v":""},{"$f":"IF('Paired Plot Comparison'!C17<>\"\",IF('Paired Plot Comparison'!D17<>\"\",'Paired Plot Comparison'!C17-'Paired Plot Comparison'!D17,\"\"),\"\")","v":""},0,0,{"$f":"IF(I17<>\"\",STDEV($I$11:I17),\"\")","v":""},{"$f":"IF(I17<>\"\",(($N$1+$N$3)^2*L17^2)/($L$1*'Paired Plot Comparison'!$B$3)^2,\"\")","v":""}]
[8,null,null,null,{"$f":"IF('Paired Plot Comparison'!I18<>\"\",AVERAGE('Paired Plot Comparison'!$I$11:I18),\"\")","v":""},{"$f":"IF('Paired Plot Comparison'!I18<>\"\",IF(A18>'Paired Plot Comparison'!M18,IF('Paired Plot Comparison'!E18>'Paired Plot Comparison'!$N$4,\"Inconclusive(H1)\",IF('Paired Plot Comparison'!E18<-'Paired Plot Comparison'!$N$4,\"Inconclusive(H1)\", \"Pass(H0)\")),\"Inconclusive\"),\"\")","v":""},{"$f":"IF('Paired Plot Comparison'!I18<>\"\",IF(F18=\"Pass(H0)\",1+G17,0),\"\")","v":""},{"$f":"IF('Paired Plot Comparison'!I18<>\"\",IF(G18>=$B$6,\"Verification Successful\", \"Verification not Satisfied\"),\"\")","v":""},{"$f":"IF('Paired Plot Comparison'!C18<>\"\",IF('Paired Plot Comparison'!D18<>\"\",'Paired Plot Comparison'!C18-'Paired Plot Comparison'!D18,\"\"),\"\")","v":""},0,0,{"$f":"IF(I18<>\"\",STDEV($I$11:I18),\"\")","v":""},{"$f":"IF(I18<>\"\",(($N$1+$N$3)^2*L18^2)/($L$1*'Paired Plot Comparison'!$B$3)^2,\"\")","v":""}]
[9,null,null,null,{"$f":"IF('Paired Plot Comparison'!I19<>\"\",AVERAGE('Paired Plot Comparison'!$I$11:I19),\"\")","v":""},{"$f":"IF('Paired Plot Comparison'!I19<>\"\",IF(A19>'Paired Plot Comparison'!M19,IF('Paired Plot Comparison'!E19>'Paired Plot Comparison'!$N$4,\"Inconclusive(H1)\",IF('Paired Plot Comparison'!E19<-'Paired Plot Comparison'!$N$4,\"Inconclusive(H1)\", \"Pass(H0)\")),\"Inconclusive\"),\"\")","v":""},{"$f":"IF('Paired Plot Comparison'!I19<>\"\",IF(F19=\"Pass(H0)\",1+G18,0),\"\")","v":""},{"$f":"IF('Paired Plot Comparison'!I19<>\"\",IF(G19>=$B$6,\"Verification Successful\", \"Verification not Satisfied\"),\"\")","v":""},{"$f":"IF('Paired Plot Comparison'!C19<>\"\",IF('Paired Plot Comparison'!D19<>\"\",'Paired Plot Comparison'!C19-'Paired Plot Comparison'!D19,\"\"),\"\")","v":""},0,0,{"$f":"IF(I19<>\"\",STDEV($I$11:I19),\"\")","v":""},{"$f":"IF(I19<>\"\",(($N$1+$N$3)^2*L19^2)/($L$1*'Paired Plot Comparison'!$B$3)^2,\"\")","v":""}]
[10,null,null,null,{"$f":"IF('Paired Plot Comparison'!I20<>\"\",AVERAGE('Paired Plot Comparison'!$I$11:I20),\"\")","v":""},{"$f":"IF('Paired Plot Comparison'!I20<>\"\",IF(A20>'Paired Plot Comparison'!M20,IF('Paired Plot Comparison'!E20>'Paired Plot Comparison'!$N$4,\"Inconclusive(H1)\",IF('Paired Plot Comparison'!E20<-'Paired Plot Comparison'!$N$4,\"Inconclusive(H1)\", \"Pass(H0)\")),\"Inconclusive\"),\"\")","v":""},{"$f":"IF('Paired Plot Comparison'!I20<>\"\",IF(F20=\"Pass(H0)\",1+G19,0),\"\")","v":""},{"$f":"IF('Paired Plot Comparison'!I20<>\"\",IF(G20>=$B$6,\"Verification Successful\", \"Verification not Satisfied\"),\"\")","v":""},{"$f":"IF('Paired Plot Comparison'!C20<>\"\",IF('Paired Plot Comparison'!D20<>\"\",'Paired Plot Comparison'!C20-'Paired Plot Comparison'!D20,\"\"),\"\")","v":""},0,0,{"$f":"IF(I20<>\"\",STDEV($I$11:I20),\"\")","v":""},{"$f":"IF(I20<>\"\",(($N$1+$N$3)^2*L20^2)/($L$1*'Paired Plot Comparison'!$B$3)^2,\"\")","v":""}]
{"$rows_left_out":93}
{"sheet":"Unpaired Plot Comparison","index":1,"n_rows":128,"n_cols":16,"rows_kept":128,"cut":false,"hidden":false,"merged":[[5,2,5,3],[0,0,0,7],[127,0,127,5],[1,0,1,7]]}
["Sequential Sampling Worksheet for Verification Inventory where Project Plots are Not Monumented "]
["(Unpaired Plot Comparison)"]
["Allowance:",0.1,"Number of Strata in Verification Sample:",1,null,null,null,null,null,null,null,null,null,"max",400]
["Alpha:",0.05,"Project Acreage:","501-5,000",null,null,null,null,null,null,null,null,null,"min",300]
["Project/Stratum  n:",null,"Minimum Number of Passing Plots in Sequence:",{"$f":"plotnumber(D3, D4)","v":16},null,null,null,null,null,null,null,null,"a:",{"$f":"NORMINV($B$4/2,0,1)","v":-1.9599639845400538}]
["Project/Stratum Mean \n(metric tons CO2e/acre):",null,null,null,null,null,null,null,null,null,null,null,"d:",{"$f":"B6*B3","v":0}]
["Project/Stratum SD \n(metric tons CO2e/acre):"]
["Verifier Plot  (n)","Verification Estimate \n(metric tons CO2e/acre)","Running Examination/Plot Success","Number of Passing Plots in Sequence","Status of Verification","Running Mean","All Plots (Verifier + Project) n","Upper","Lower","Running SD","n_Threshold","Tn","Calculations",null,"N","n"]
[1,null,{"$f":"IF(B9<>\"\",IF(ABS(B9-B6)<(B3*B6),\"Pass(H0)\",\"Inconclusive(H1)\"),\"\")","v":""},{"$f":"IF(F9<>\"\",IF(C9=\"Pass(H0)\",1,0),\"\")","v":0},{"$f":"IF(F9<>\"\",IF(D9>=$D$5,\"Verification Successful\", \"Verification not Satisfied\"),\"\")","v":"Verification not Satisfied"},{"$f":"B9","v":0},{"$f":"$B$5+A9","v":1},null,null,null,null,null,{"$f":"IF(C9<>\"Again\",1,0)","v":1},{"$f":"A9","v":1},{"$f":"VLOOKUP(1,$M$9:$N$108,2,FALSE)","v":1},{"$f":"MIN(VLOOKUP(1,$M$9:$N$108,2,TRUE),O9)","v":1}]
[2,null,{"$f":"IF(B10<>\"\",IF(G10>=K10,IF(H10<=0,IF(I10>=0,\"Pass(H0)\",\"Inconclusive(H1)\"),\"Inconclusive(H1)\"),\"Inconclusive\"),\"\")","v":""},{"$f":"IF(F10<>\"\",IF(C10=\"Pass(H0)\",1+D9,0),\"\")","v":""},"",{"$f":"IF(B10<>\"\",AVERAGE(B$9:$B10),\"\")","v":""},2,{"$f":"IF(B10<>\"\",L10-$N$6,\"\")","v":""},{"$f":"IF(B10<>\"\",L10+$N$6,\"\")","v":""},{"$f":"IF(B10<>\"\",STDEV(B$9:$B10),\"\")","v":""},{"$f":"IF(B10<>\"\",($N$5^2/$N$6^2)*($B$7^2+J10^2),\"\")","v":""},{"$f":"IF(B10<>\"\",$B$6-F10,\"\")","v":""},1,2,{"$f":"ADDRESS(11+O9-1,4)","v":"$D$11"},{"$f":"ADDRESS(11+P9,4)","v":"$D$12"}]
[3,null,"","","",{"$f":"IF(B11<>\"\",AVERAGE(B$9:$B11),\"\")","v":""},3,"","",{"$f":"IF(B11<>\"\",STDEV(B$9:$B11),\"\")","v":""},"","",1,3]
[4,null,"","","",{"$f":"IF(B12<>\"\",AVERAGE(B$9:$B12),\"\")","v":""},4,"","",{"$f":"IF(B12<>\"\",STDEV(B$9:$B12),\"\")","v":""},"","",1,4]
[5,null,"","","",{"$f":"IF(B13<>\"\",AVERAGE(B$9:$B13),\"\")","v":""},5,"","",{"$f":"IF(B13<>\"\",STDEV(B$9:$B13),\"\")","v":""},"","",1,5]
[6,null,"","","",{"$f":"IF(B14<>\"\",AVERAGE(B$9:$B14),\"\")","v":""},6,"","",{"$f":"IF(B14<>\"\",STDEV(B$9:$B14),\"\")","v":""},"","",1,6]
[7,null,"","","",{"$f":"IF(B15<>\"\",AVERAGE(B$9:$B15),\"\")","v":""},7,"","",{"$f":"IF(B15<>\"\",STDEV(B$9:$B15),\"\")","v":""},"","",1,7]
[8,null,"","","",{"$f":"IF(B16<>\"\",AVERAGE(B$9:$B16),\"\")","v":""},8,"","",{"$f":"IF(B16<>\"\",STDEV(B$9:$B16),\"\")","v":""},"","",1,8]
[9,null,"","","",{"$f":"IF(B17<>\"\",AVERAGE(B$9:$B17),\"\")","v":""},9,"","",{"$f":"IF(B17<>\"\",STDEV(B$9:$B17),\"\")","v":""},"","",1,9]
[10,null,"","","",{"$f":"IF(B18<>\"\",AVERAGE(B$9:$B18),\"\")","v":""},10,"","",{"$f":"IF(B18<>\"\",STDEV(B$9:$B18),\"\")","v":""},"","",1,10]
[11,null,"","","",{"$f":"IF(B19<>\"\",AVERAGE(B$9:$B19),\"\")","v":""},11,"","",{"$f":"IF(B19<>\"\",STDEV(B$9:$B19),\"\")","v":""},"","",1,11]
[12,null,"","","",{"$f":"IF(B20<>\"\",AVERAGE(B$9:$B20),\"\")","v":""},12,"","",{"$f":"IF(B20<>\"\",STDEV(B$9:$B20),\"\")","v":""},"","",1,12]
{"$rows_left_out":109}
{"sheet":"Dropdown Selections","index":2,"n_rows":5,"n_cols":2,"rows_kept":5,"cut":false,"hidden":true,"merged":[]}
["strata","acreage"]
[1,"<100"]
[2,"100-500"]
[3,"501-5,000"]
[null,">5,000"]